Information card for entry 7035658
Formula | C46 H40 Cu2 La Mo N12 O8 |
Calculated formula | C46 H40 Cu2 La Mo N12 O8 |
Title of publication | Magneto-structural variety of new 3d-4f-4(5)d heterotrimetallic complexes. |
Authors of publication | Visinescu, Diana; Alexandru, Maria-Gabriela; Madalan, Augustin M.; Pichon, Céline; Duhayon, Carine; Sutter, Jean-Pascal; Andruh, Marius |
Journal of publication | Dalton transactions (Cambridge, England : 2003) |
Year of publication | 2015 |
Journal volume | 44 |
Journal issue | 38 |
Pages of publication | 16713 - 16727 |
a | 15.6813 ± 0.001 Å |
b | 19.0221 ± 0.0017 Å |
c | 17.6117 ± 0.001 Å |
α | 90° |
β | 90° |
γ | 90° |
Cell volume | 5253.4 ± 0.6 Å3 |
Cell temperature | 293 ± 2 K |
Ambient diffraction temperature | 293 ± 2 K |
Number of distinct elements | 7 |
Space group number | 20 |
Hermann-Mauguin space group symbol | C 2 2 21 |
Hall space group symbol | C 2c 2 |
Residual factor for all reflections | 0.0758 |
Residual factor for significantly intense reflections | 0.0471 |
Weighted residual factors for significantly intense reflections | 0.079 |
Weighted residual factors for all reflections included in the refinement | 0.0863 |
Goodness-of-fit parameter for all reflections included in the refinement | 0.91 |
Diffraction radiation wavelength | 0.71073 Å |
Diffraction radiation type | MoKα |