Information card for entry 7035677
Formula | C9 H23 B11 F10 N2 |
Calculated formula | C9 H23 B11 F10 N2 |
SMILES | [CH]1234[B]567(F)[B]891(F)[B]1%102(F)[B]2%113(F)[B]345(F)[B]45%11([B]%11%102([B]291([B]168(F)[B]734(F)[B]5%1121N)F)F)F.[N+](CC)(CC)(CC)CC |
Title of publication | Polyfluorinated carba-closo-dodecaboranes with amino and ammonio substituents bonded to boron. |
Authors of publication | Konieczka, Szymon Z.; Drisch, Michael; Edkins, Katharina; Hailmann, Michael; Finze, Maik |
Journal of publication | Dalton transactions (Cambridge, England : 2003) |
Year of publication | 2015 |
Journal volume | 44 |
Journal issue | 45 |
Pages of publication | 19576 - 19586 |
a | 13.3754 ± 0.001 Å |
b | 11.0807 ± 0.0008 Å |
c | 13.7559 ± 0.001 Å |
α | 90° |
β | 102.726 ± 0.003° |
γ | 90° |
Cell volume | 1988.7 ± 0.3 Å3 |
Cell temperature | 100 ± 2 K |
Ambient diffraction temperature | 100 ± 2 K |
Number of distinct elements | 5 |
Space group number | 14 |
Hermann-Mauguin space group symbol | P 1 21/n 1 |
Hall space group symbol | -P 2yn |
Residual factor for all reflections | 0.0496 |
Residual factor for significantly intense reflections | 0.0375 |
Weighted residual factors for significantly intense reflections | 0.092 |
Weighted residual factors for all reflections included in the refinement | 0.0969 |
Goodness-of-fit parameter for all reflections included in the refinement | 1.075 |
Diffraction radiation wavelength | 0.71073 Å |
Diffraction radiation type | MoKα |