Information card for entry 7035681
Formula | C27 H17 N2 O7 Sm |
Calculated formula | C27 H17 N2 O7 Sm |
Title of publication | Magnetic and luminescent properties of lanthanide coordination polymers with asymmetric biphenyl-3,2',5'-tricarboxylate. |
Authors of publication | Zhao, Jie; Zhu, Guan-Hong; Xie, Li-Qiong; Wu, Ye-Si; Wu, Hai-Lun; Zhou, Ai-Ju; Wu, Zun-Yuan; Wang, Jing; Chen, Yan-Cong; Tong, Ming-Liang |
Journal of publication | Dalton transactions (Cambridge, England : 2003) |
Year of publication | 2015 |
Journal volume | 44 |
Journal issue | 32 |
Pages of publication | 14424 - 14435 |
a | 26.5873 ± 0.0004 Å |
b | 7.9379 ± 0.0001 Å |
c | 23.1031 ± 0.0003 Å |
α | 90° |
β | 107.384 ± 0.001° |
γ | 90° |
Cell volume | 4653.14 ± 0.11 Å3 |
Cell temperature | 296 ± 2 K |
Ambient diffraction temperature | 296 ± 2 K |
Number of distinct elements | 5 |
Space group number | 15 |
Hermann-Mauguin space group symbol | C 1 2/c 1 |
Hall space group symbol | -C 2yc |
Residual factor for all reflections | 0.0327 |
Residual factor for significantly intense reflections | 0.0245 |
Weighted residual factors for significantly intense reflections | 0.0505 |
Weighted residual factors for all reflections included in the refinement | 0.0544 |
Goodness-of-fit parameter for all reflections included in the refinement | 1.005 |
Diffraction radiation wavelength | 0.71073 Å |
Diffraction radiation type | MoKα |