Information card for entry 7035683
Formula | C27 H17 N2 Nd O7 |
Calculated formula | C27 H17 N2 Nd O7 |
Title of publication | Magnetic and luminescent properties of lanthanide coordination polymers with asymmetric biphenyl-3,2',5'-tricarboxylate. |
Authors of publication | Zhao, Jie; Zhu, Guan-Hong; Xie, Li-Qiong; Wu, Ye-Si; Wu, Hai-Lun; Zhou, Ai-Ju; Wu, Zun-Yuan; Wang, Jing; Chen, Yan-Cong; Tong, Ming-Liang |
Journal of publication | Dalton transactions (Cambridge, England : 2003) |
Year of publication | 2015 |
Journal volume | 44 |
Journal issue | 32 |
Pages of publication | 14424 - 14435 |
a | 26.6409 ± 0.0013 Å |
b | 7.9552 ± 0.0004 Å |
c | 23.1863 ± 0.0012 Å |
α | 90° |
β | 107.432 ± 0.003° |
γ | 90° |
Cell volume | 4688.3 ± 0.4 Å3 |
Cell temperature | 296 ± 2 K |
Ambient diffraction temperature | 296 ± 2 K |
Number of distinct elements | 5 |
Space group number | 15 |
Hermann-Mauguin space group symbol | C 1 2/c 1 |
Hall space group symbol | -C 2yc |
Residual factor for all reflections | 0.0606 |
Residual factor for significantly intense reflections | 0.0361 |
Weighted residual factors for significantly intense reflections | 0.0614 |
Weighted residual factors for all reflections included in the refinement | 0.0692 |
Goodness-of-fit parameter for all reflections included in the refinement | 1.003 |
Diffraction radiation wavelength | 0.71073 Å |
Diffraction radiation type | MoKα |