Information card for entry 7035690
Formula | C30 H46 Eu Fe7 N6 O44 P6 |
Calculated formula | C30 H45.96 Eu Fe7 N6 O44 P6 |
Title of publication | Ionothermal synthesis, crystal structure, topology and catalytic properties of heterometallic coordination polymers constructed from N-(phosphonomethyl) iminodiacetic acid. |
Authors of publication | Yang, Ting-Hai; Silva, Ana Rosa; Fu, Lianshe; Shi, Fa-Nian |
Journal of publication | Dalton transactions (Cambridge, England : 2003) |
Year of publication | 2015 |
Journal volume | 44 |
Journal issue | 30 |
Pages of publication | 13745 - 13751 |
a | 15.372 ± 0.0004 Å |
b | 15.372 ± 0.0004 Å |
c | 22.8499 ± 0.0017 Å |
α | 90° |
β | 90° |
γ | 120° |
Cell volume | 4676 ± 0.4 Å3 |
Cell temperature | 296 ± 2 K |
Ambient diffraction temperature | 296 ± 2 K |
Number of distinct elements | 7 |
Space group number | 148 |
Hermann-Mauguin space group symbol | R -3 :H |
Hall space group symbol | -R 3 |
Residual factor for all reflections | 0.0962 |
Residual factor for significantly intense reflections | 0.0566 |
Weighted residual factors for significantly intense reflections | 0.1079 |
Weighted residual factors for all reflections included in the refinement | 0.1222 |
Goodness-of-fit parameter for all reflections included in the refinement | 1.029 |
Diffraction radiation wavelength | 0.71073 Å |
Diffraction radiation type | MoKα |