Information card for entry 7035692
Formula | C30 H46 Fe7 Ho N6 O44 P6 |
Calculated formula | C30 H45.96 Fe7 Ho N6 O44 P6 |
Title of publication | Ionothermal synthesis, crystal structure, topology and catalytic properties of heterometallic coordination polymers constructed from N-(phosphonomethyl) iminodiacetic acid. |
Authors of publication | Yang, Ting-Hai; Silva, Ana Rosa; Fu, Lianshe; Shi, Fa-Nian |
Journal of publication | Dalton transactions (Cambridge, England : 2003) |
Year of publication | 2015 |
Journal volume | 44 |
Journal issue | 30 |
Pages of publication | 13745 - 13751 |
a | 15.2935 ± 0.0004 Å |
b | 15.2935 ± 0.0004 Å |
c | 22.7749 ± 0.0012 Å |
α | 90° |
β | 90° |
γ | 120° |
Cell volume | 4613.2 ± 0.3 Å3 |
Cell temperature | 293 ± 2 K |
Ambient diffraction temperature | 293 ± 2 K |
Number of distinct elements | 7 |
Space group number | 148 |
Hermann-Mauguin space group symbol | R -3 :H |
Hall space group symbol | -R 3 |
Residual factor for all reflections | 0.0554 |
Residual factor for significantly intense reflections | 0.047 |
Weighted residual factors for significantly intense reflections | 0.1361 |
Weighted residual factors for all reflections included in the refinement | 0.1398 |
Goodness-of-fit parameter for all reflections included in the refinement | 1.047 |
Diffraction radiation wavelength | 0.71073 Å |
Diffraction radiation type | MoKα |