Information card for entry 7035703
Formula | C38 H43 F12 N9 Ni P2 |
Calculated formula | C38 H40 F12 N9 Ni P2 |
Title of publication | Synthesis of a flexible macrocyclic tetraimidazolium salt-precursor for a tetracarbene ligand with metal dependent coordination modes. |
Authors of publication | Schulte To Brinke, Christian; Ekkehardt Hahn, F. |
Journal of publication | Dalton transactions (Cambridge, England : 2003) |
Year of publication | 2015 |
Journal volume | 44 |
Journal issue | 32 |
Pages of publication | 14315 - 14322 |
a | 12.0643 ± 0.0003 Å |
b | 12.3563 ± 0.0003 Å |
c | 15.4897 ± 0.0003 Å |
α | 93.802 ± 0.001° |
β | 99.14 ± 0.001° |
γ | 113.346 ± 0.001° |
Cell volume | 2071.7 ± 0.08 Å3 |
Cell temperature | 153 ± 2 K |
Ambient diffraction temperature | 153 ± 2 K |
Number of distinct elements | 6 |
Space group number | 2 |
Hermann-Mauguin space group symbol | P -1 |
Hall space group symbol | -P 1 |
Residual factor for all reflections | 0.0962 |
Residual factor for significantly intense reflections | 0.0741 |
Weighted residual factors for significantly intense reflections | 0.1937 |
Weighted residual factors for all reflections included in the refinement | 0.2112 |
Goodness-of-fit parameter for all reflections included in the refinement | 1.011 |
Diffraction radiation wavelength | 0.71073 Å |
Diffraction radiation type | MoKα |