Information card for entry 7035705
Formula | C38 H43 F12 N9 P2 Pt |
Calculated formula | C38 H43 F12.004 N9 P2 Pt |
Title of publication | Synthesis of a flexible macrocyclic tetraimidazolium salt-precursor for a tetracarbene ligand with metal dependent coordination modes. |
Authors of publication | Schulte To Brinke, Christian; Ekkehardt Hahn, F. |
Journal of publication | Dalton transactions (Cambridge, England : 2003) |
Year of publication | 2015 |
Journal volume | 44 |
Journal issue | 32 |
Pages of publication | 14315 - 14322 |
a | 12.0669 ± 0.0002 Å |
b | 12.3711 ± 0.0002 Å |
c | 15.6154 ± 0.0003 Å |
α | 92.946 ± 0.001° |
β | 99.601 ± 0.001° |
γ | 112.867 ± 0.001° |
Cell volume | 2100.4 ± 0.07 Å3 |
Cell temperature | 153 ± 2 K |
Ambient diffraction temperature | 153 ± 2 K |
Number of distinct elements | 6 |
Space group number | 2 |
Hermann-Mauguin space group symbol | P -1 |
Hall space group symbol | -P 1 |
Residual factor for all reflections | 0.0454 |
Residual factor for significantly intense reflections | 0.038 |
Weighted residual factors for significantly intense reflections | 0.092 |
Weighted residual factors for all reflections included in the refinement | 0.0951 |
Goodness-of-fit parameter for all reflections included in the refinement | 1.045 |
Diffraction radiation wavelength | 0.71073 Å |
Diffraction radiation type | MoKα |