Information card for entry 7035707
Formula | C35.5 H26 B F15 N2 |
Calculated formula | C35.5 H26 B F15 N2 |
Title of publication | Synthesis of new asymmetric substituted boron amidines - reactions with CO and transfer hydrogenations of phenylacetylene. |
Authors of publication | Cabrera, Alan R.; Rojas, Rene S.; Valderrama, Mauricio; Plüss, Pascal; Berke, Heinz; Daniliuc, Constantin G.; Kehr, Gerald; Erker, Gerhard |
Journal of publication | Dalton transactions (Cambridge, England : 2003) |
Year of publication | 2015 |
Journal volume | 44 |
Journal issue | 45 |
Pages of publication | 19606 - 19614 |
a | 9.9877 ± 0.0002 Å |
b | 11.1552 ± 0.0002 Å |
c | 18.1937 ± 0.0003 Å |
α | 72.658 ± 0.001° |
β | 82.828 ± 0.001° |
γ | 66.788 ± 0.001° |
Cell volume | 1778.22 ± 0.06 Å3 |
Cell temperature | 223 ± 2 K |
Ambient diffraction temperature | 223 ± 2 K |
Number of distinct elements | 5 |
Space group number | 2 |
Hermann-Mauguin space group symbol | P -1 |
Hall space group symbol | -P 1 |
Residual factor for all reflections | 0.0632 |
Residual factor for significantly intense reflections | 0.0535 |
Weighted residual factors for significantly intense reflections | 0.1227 |
Weighted residual factors for all reflections included in the refinement | 0.1326 |
Goodness-of-fit parameter for all reflections included in the refinement | 1.064 |
Diffraction radiation wavelength | 0.71073 Å |
Diffraction radiation type | MoKα |