Information card for entry 7035719
Formula | C25 H27 Br3 Fe K O3 P S Zn |
Calculated formula | C25 H27 Br3 Fe K O3 P S Zn |
SMILES | [K+].[Zn](Br)(Br)(Br)[P]([c]12[cH]3[Fe]4567891([c]1([cH]4[cH]5[cH]6[cH]71)CS(=O)(=O)C)[cH]2[cH]8[cH]39)(c1ccccc1)c1ccccc1.OC |
Title of publication | Ferrocenylmethylation reactions with a phosphinoferrocene betaine. |
Authors of publication | Zábranský, Martin; Císařová, Ivana; Štěpnička, Petr |
Journal of publication | Dalton transactions (Cambridge, England : 2003) |
Year of publication | 2015 |
Journal volume | 44 |
Journal issue | 32 |
Pages of publication | 14494 - 14506 |
a | 8.8279 ± 0.0003 Å |
b | 9.3796 ± 0.0003 Å |
c | 18.2463 ± 0.0005 Å |
α | 88.4567 ± 0.0011° |
β | 80.3074 ± 0.0011° |
γ | 85.6905 ± 0.0011° |
Cell volume | 1484.9 ± 0.08 Å3 |
Cell temperature | 150 ± 2 K |
Ambient diffraction temperature | 150 ± 2 K |
Number of distinct elements | 9 |
Space group number | 2 |
Hermann-Mauguin space group symbol | P -1 |
Hall space group symbol | -P 1 |
Residual factor for all reflections | 0.0319 |
Residual factor for significantly intense reflections | 0.0233 |
Weighted residual factors for significantly intense reflections | 0.0477 |
Weighted residual factors for all reflections included in the refinement | 0.0499 |
Goodness-of-fit parameter for all reflections included in the refinement | 1.037 |
Diffraction radiation wavelength | 0.71073 Å |
Diffraction radiation type | MoKα |