Information card for entry 7035724
Formula | C23.5 H28 Cu N3 O7 |
Calculated formula | C23.5 H28 Cu N3 O7 |
Title of publication | Catalytic dioxygenation of flavonol by M(II)-complexes (M = Mn, Fe, Co, Ni, Cu and Zn) - mimicking the M(II)-substituted quercetin 2,3-dioxygenase. |
Authors of publication | Sun, Ying-Ji; Huang, Qian-Qian; Li, Pei; Zhang, Jian-Jun |
Journal of publication | Dalton transactions (Cambridge, England : 2003) |
Year of publication | 2015 |
Journal volume | 44 |
Journal issue | 31 |
Pages of publication | 13926 - 13938 |
a | 10.9928 ± 0.0002 Å |
b | 12.0354 ± 0.0002 Å |
c | 18.6928 ± 0.0003 Å |
α | 83.421 ± 0.001° |
β | 78.423 ± 0.001° |
γ | 80.37 ± 0.001° |
Cell volume | 2380.24 ± 0.07 Å3 |
Cell temperature | 296 ± 2 K |
Ambient diffraction temperature | 296 ± 2 K |
Number of distinct elements | 5 |
Space group number | 2 |
Hermann-Mauguin space group symbol | P -1 |
Hall space group symbol | -P 1 |
Residual factor for all reflections | 0.0462 |
Residual factor for significantly intense reflections | 0.034 |
Weighted residual factors for significantly intense reflections | 0.0912 |
Weighted residual factors for all reflections included in the refinement | 0.0966 |
Goodness-of-fit parameter for all reflections included in the refinement | 1.006 |
Diffraction radiation wavelength | 0.71073 Å |
Diffraction radiation type | MoKα |