Information card for entry 7035732
Formula | C40 H39 Eu N8 O12 |
Calculated formula | C40 H39 Eu N8 O12 |
Title of publication | A new class of thermotropic lanthanidomesogens: Eu(iii) nitrate complexes with mesogenic 4-pyridone ligands. |
Authors of publication | Pană, Amalia; Chiriac, Florentina L.; Secu, Mihail; Pasuk, Iuliana; Ferbinteanu, Marilena; Micutz, Marin; Cîrcu, Viorel |
Journal of publication | Dalton transactions (Cambridge, England : 2003) |
Year of publication | 2015 |
Journal volume | 44 |
Journal issue | 32 |
Pages of publication | 14196 - 14199 |
a | 13.2723 ± 0.0004 Å |
b | 13.4162 ± 0.0003 Å |
c | 14.652 ± 0.001 Å |
α | 78.952 ± 0.006° |
β | 80.569 ± 0.006° |
γ | 61.141 ± 0.004° |
Cell volume | 2234.9 ± 0.2 Å3 |
Cell temperature | 293 ± 2 K |
Ambient diffraction temperature | 293 ± 2 K |
Number of distinct elements | 5 |
Space group number | 2 |
Hermann-Mauguin space group symbol | P -1 |
Hall space group symbol | -P 1 |
Residual factor for all reflections | 0.0375 |
Residual factor for significantly intense reflections | 0.0308 |
Weighted residual factors for significantly intense reflections | 0.069 |
Weighted residual factors for all reflections included in the refinement | 0.0738 |
Goodness-of-fit parameter for all reflections included in the refinement | 1.058 |
Diffraction radiation wavelength | 0.71073 Å |
Diffraction radiation type | MoKα |