Information card for entry 7036123
Formula | C14 H21 Cl2 N3 O2 Ru S2 |
Calculated formula | C14 H21 Cl2 N3 O2 Ru S2 |
SMILES | [Ru]1(Cl)(Cl)([S](=O)(C)C)([S](=O)(C)C)[n]2ccc(nc2c2[n]1cccc2)C |
Title of publication | (15)N NMR spectroscopy unambiguously establishes the coordination mode of the diimine linker 2-(2'-pyridyl)pyrimidine-4-carboxylic acid (cppH) in Ru(ii) complexes. |
Authors of publication | Battistin, Federica; Balducci, Gabriele; Demitri, Nicola; Iengo, Elisabetta; Milani, Barbara; Alessio, Enzo |
Journal of publication | Dalton transactions (Cambridge, England : 2003) |
Year of publication | 2015 |
Journal volume | 44 |
Journal issue | 35 |
Pages of publication | 15671 - 15682 |
a | 13.018 ± 0.0004 Å |
b | 8.212 ± 0.0008 Å |
c | 17.521 ± 0.0004 Å |
α | 90° |
β | 91.934 ± 0.019° |
γ | 90° |
Cell volume | 1872 ± 0.2 Å3 |
Cell temperature | 100 ± 2 K |
Ambient diffraction temperature | 100 ± 2 K |
Number of distinct elements | 7 |
Space group number | 14 |
Hermann-Mauguin space group symbol | P 1 21/c 1 |
Hall space group symbol | -P 2ybc |
Residual factor for all reflections | 0.0263 |
Residual factor for significantly intense reflections | 0.0247 |
Weighted residual factors for significantly intense reflections | 0.0619 |
Weighted residual factors for all reflections included in the refinement | 0.0629 |
Goodness-of-fit parameter for all reflections included in the refinement | 1.058 |
Diffraction radiation wavelength | 0.7 Å |
Diffraction radiation type | Synchrotron |