Information card for entry 7036338
Chemical name | 5-phenyl-2-(2-pyridyl)pyridine |
Formula | C24 H18 N3 |
Calculated formula | C24.001 H18.001 N2.999 |
Title of publication | Luminescent mononuclear mixed ligand complexes of copper(i) with 5-phenyl-2,2'-bipyridine and triphenylphosphine. |
Authors of publication | Safin, Damir A.; Mitoraj, Mariusz P.; Robeyns, Koen; Filinchuk, Yaroslav; Vande Velde, Christophe M. L. |
Journal of publication | Dalton transactions (Cambridge, England : 2003) |
Year of publication | 2015 |
Journal volume | 44 |
Journal issue | 38 |
Pages of publication | 16824 - 16832 |
a | 5.618 ± 0.001 Å |
b | 15.682 ± 0.003 Å |
c | 19.716 ± 0.003 Å |
α | 90° |
β | 91.99 ± 0.002° |
γ | 90° |
Cell volume | 1736 ± 0.5 Å3 |
Cell temperature | 100 ± 2 K |
Ambient diffraction temperature | 100 ± 2 K |
Number of distinct elements | 3 |
Space group number | 14 |
Hermann-Mauguin space group symbol | P 1 21/n 1 |
Hall space group symbol | -P 2yn |
Residual factor for all reflections | 0.0801 |
Residual factor for significantly intense reflections | 0.0528 |
Weighted residual factors for significantly intense reflections | 0.1568 |
Weighted residual factors for all reflections included in the refinement | 0.1789 |
Goodness-of-fit parameter for all reflections included in the refinement | 1.049 |
Diffraction radiation wavelength | 0.71073 Å |
Diffraction radiation type | MoKα |