Information card for entry 7036444
Formula | C13.2 H17.4 Cl N3 O3.8 Re |
Calculated formula | C13.2 H17.4 Cl N3 O3.8 Re |
Title of publication | Luminescent rhenium(i) tricarbonyl complexes with pyrazolylamidino ligands: photophysical, electrochemical, and computational studies. |
Authors of publication | Gómez-Iglesias, Patricia; Guyon, Fabrice; Khatyr, Abderrahim; Ulrich, Gilles; Knorr, Michael; Martín-Alvarez, Jose Miguel; Miguel, Daniel; Villafañe, Fernando |
Journal of publication | Dalton transactions (Cambridge, England : 2003) |
Year of publication | 2015 |
Journal volume | 44 |
Journal issue | 40 |
Pages of publication | 17516 - 17528 |
a | 11.7779 ± 0.0011 Å |
b | 16.2401 ± 0.0012 Å |
c | 10.3889 ± 0.0009 Å |
α | 90° |
β | 110.011 ± 0.01° |
γ | 90° |
Cell volume | 1867.2 ± 0.3 Å3 |
Cell temperature | 293 ± 2 K |
Ambient diffraction temperature | 293 ± 2 K |
Number of distinct elements | 6 |
Space group number | 14 |
Hermann-Mauguin space group symbol | P 1 21/c 1 |
Hall space group symbol | -P 2ybc |
Residual factor for all reflections | 0.1388 |
Residual factor for significantly intense reflections | 0.0887 |
Weighted residual factors for significantly intense reflections | 0.2417 |
Weighted residual factors for all reflections included in the refinement | 0.3216 |
Goodness-of-fit parameter for all reflections included in the refinement | 1.09 |
Diffraction radiation probe | x-ray |
Diffraction radiation wavelength | 0.71073 Å |
Diffraction radiation type | MoKα |