Information card for entry 7036642
Formula | C49 H42 Cl3 N3 P4 Ru S5 |
Calculated formula | C49 H40 Cl3 N3 P4 Ru S5 |
Title of publication | Ruthenium chalcogenonitrosyl and bridged nitrido complexes containing chelating sulfur and oxygen ligands. |
Authors of publication | Ng, Ho-Yuen; Cheung, Wai-Man; Kwan Huang, Enrique; Wong, Kang-Long; Sung, Herman H.-Y.; Williams, Ian D.; Leung, Wa-Hung |
Journal of publication | Dalton transactions (Cambridge, England : 2003) |
Year of publication | 2015 |
Journal volume | 44 |
Journal issue | 42 |
Pages of publication | 18459 - 18468 |
a | 14.3179 ± 0.0015 Å |
b | 9.3685 ± 0.001 Å |
c | 18.4542 ± 0.0019 Å |
α | 90° |
β | 91.968 ± 0.001° |
γ | 90° |
Cell volume | 2473.9 ± 0.4 Å3 |
Cell temperature | 100 K |
Ambient diffraction temperature | 100 K |
Number of distinct elements | 7 |
Space group number | 14 |
Hermann-Mauguin space group symbol | P 1 21/n 1 |
Hall space group symbol | -P 2yn |
Residual factor for all reflections | 0.0627 |
Residual factor for significantly intense reflections | 0.0547 |
Weighted residual factors for significantly intense reflections | 0.1501 |
Weighted residual factors for all reflections included in the refinement | 0.1549 |
Goodness-of-fit parameter for all reflections included in the refinement | 1.001 |
Diffraction radiation probe | x-ray |
Diffraction radiation wavelength | 0.71073 Å |
Diffraction radiation type | MoKα |