Information card for entry 7036968
Formula | C16 H24 B2 Fe N6 |
Calculated formula | C16 H24 B2 Fe N6 |
Title of publication | In air a spin crossover active iron(ii) complex of amine/NCBH3(-) ligands is converted to a low spin complex of imine/CN(-) ligands. |
Authors of publication | Zhou, Jian; Zhu, Bo-Wen; Luan, Jie; Liu, Zhan; Fang, Jing-Kun; Bao, Xin; Peng, Guo; Tucek, Jiri; Bao, Song-Song; Zheng, Li-Min |
Journal of publication | Dalton transactions (Cambridge, England : 2003) |
Year of publication | 2015 |
Journal volume | 44 |
Journal issue | 47 |
Pages of publication | 20551 - 20561 |
a | 14.3196 ± 0.0018 Å |
b | 15.4416 ± 0.0014 Å |
c | 9.451 ± 0.001 Å |
α | 90° |
β | 90° |
γ | 90° |
Cell volume | 2089.8 ± 0.4 Å3 |
Cell temperature | 373 ± 2 K |
Ambient diffraction temperature | 373 ± 2 K |
Number of distinct elements | 5 |
Space group number | 41 |
Hermann-Mauguin space group symbol | A e a 2 |
Hall space group symbol | A 2 -2ab |
Residual factor for all reflections | 0.101 |
Residual factor for significantly intense reflections | 0.0395 |
Weighted residual factors for significantly intense reflections | 0.0728 |
Weighted residual factors for all reflections included in the refinement | 0.1001 |
Goodness-of-fit parameter for all reflections included in the refinement | 1.052 |
Diffraction radiation wavelength | 0.71073 Å |
Diffraction radiation type | MoKα |