Information card for entry 7037576
Formula | C8 H24 Br4 N2 Pb |
Calculated formula | C8 H24 Br4 N2 Pb |
Title of publication | Sequential structural transitions with distinct dielectric responses in a layered perovskite organic-inorganic hybrid material: [C4H9N]2[PbBr4]. |
Authors of publication | Wang, Zhong-Xia; Liao, Wei-Qiang; Ye, Heng-Yun; Zhang, Yi |
Journal of publication | Dalton transactions (Cambridge, England : 2003) |
Year of publication | 2015 |
Journal volume | 44 |
Journal issue | 47 |
Pages of publication | 20406 - 20412 |
a | 14.196 ± 0.003 Å |
b | 8.3416 ± 0.0017 Å |
c | 8.2422 ± 0.0016 Å |
α | 90° |
β | 105.32 ± 0.03° |
γ | 90° |
Cell volume | 941.3 ± 0.4 Å3 |
Cell temperature | 293 ± 2 K |
Ambient diffraction temperature | 293 ± 2 K |
Number of distinct elements | 5 |
Space group number | 14 |
Hermann-Mauguin space group symbol | P 1 21/c 1 |
Hall space group symbol | -P 2ybc |
Residual factor for all reflections | 0.1144 |
Residual factor for significantly intense reflections | 0.0668 |
Weighted residual factors for significantly intense reflections | 0.1288 |
Weighted residual factors for all reflections included in the refinement | 0.1431 |
Goodness-of-fit parameter for all reflections included in the refinement | 1 |
Diffraction radiation wavelength | 0.71073 Å |
Diffraction radiation type | MoKα |