Information card for entry 7037670
Formula | C36 H34 Cu3 Ge N7 O45.5 W12 |
Calculated formula | C36 H30 Cu3 Ge N7 O45.5 W12 |
Title of publication | New organic-inorganic hybrid compounds constructed from polyoxometalates and transition metal mixed-organic-ligand complexes. |
Authors of publication | Hu, Yang-Yang; Zhang, Ting-Ting; Zhang, Xiao; Zhao, De-Chuan; Cui, Xiao-Bing; Huo, Qi-Sheng; Xu, Ji-Qing |
Journal of publication | Dalton transactions (Cambridge, England : 2003) |
Year of publication | 2016 |
Journal volume | 45 |
Journal issue | 6 |
Pages of publication | 2562 - 2573 |
a | 23.41 ± 0.003 Å |
b | 12.9698 ± 0.0016 Å |
c | 22.779 ± 0.003 Å |
α | 90° |
β | 109.576 ± 0.002° |
γ | 90° |
Cell volume | 6516.5 ± 1.4 Å3 |
Cell temperature | 296 ± 2 K |
Ambient diffraction temperature | 296 ± 2 K |
Number of distinct elements | 7 |
Space group number | 14 |
Hermann-Mauguin space group symbol | P 1 21/c 1 |
Hall space group symbol | -P 2ybc |
Residual factor for all reflections | 0.1084 |
Residual factor for significantly intense reflections | 0.0526 |
Weighted residual factors for significantly intense reflections | 0.0848 |
Weighted residual factors for all reflections included in the refinement | 0.0992 |
Goodness-of-fit parameter for all reflections included in the refinement | 1.008 |
Diffraction radiation wavelength | 0.71073 Å |
Diffraction radiation type | MoKα |