Information card for entry 7038203
Formula |
C46 H42 Cl3 F6 Ir2 O4 P5 |
Calculated formula |
C46 H42 Cl3 F6 Ir2 O4 P5 |
Title of publication |
Oxidative addition of an aromatic ortho C-H bond of tetraphosphine to asymmetric diiridium(i) centres. |
Authors of publication |
Nakajima, Takayuki; Noda, Sayo; Sakamoto, Miyuki; Matsui, Aya; Nakamae, Kanako; Kure, Bunsho; Ura, Yasuyuki; Tanase, Tomoaki |
Journal of publication |
Dalton transactions (Cambridge, England : 2003) |
Year of publication |
2016 |
Journal volume |
45 |
Journal issue |
11 |
Pages of publication |
4747 - 4761 |
a |
12.621 ± 0.003 Å |
b |
14.45 ± 0.003 Å |
c |
14.58 ± 0.003 Å |
α |
67.321 ± 0.008° |
β |
85.71 ± 0.008° |
γ |
88.282 ± 0.009° |
Cell volume |
2446.5 ± 0.9 Å3 |
Cell temperature |
153 ± 2 K |
Ambient diffraction temperature |
153 ± 2 K |
Number of distinct elements |
7 |
Space group number |
2 |
Hermann-Mauguin space group symbol |
P -1 |
Hall space group symbol |
-P 1 |
Residual factor for significantly intense reflections |
0.0389 |
Weighted residual factors for all reflections included in the refinement |
0.1048 |
Goodness-of-fit parameter for all reflections included in the refinement |
0.925 |
Diffraction radiation wavelength |
0.71075 Å |
Diffraction radiation type |
MoKα |
Yes |
No |
No |