Information card for entry 7040542
Formula | C71 H53 Cl11 O4 P2 Pd |
Calculated formula | C71 H53 Cl11 O4 P2 Pd |
Title of publication | A comparison of MOP-phosphonite ligands and their applications in Rh(i)- and Pd(ii)-catalysed asymmetric transformations. |
Authors of publication | Fleming, James T.; Wills, Corinne; Waddell, Paul G.; Harrington, Ross W.; Higham, Lee J. |
Journal of publication | Dalton transactions (Cambridge, England : 2003) |
Year of publication | 2016 |
Journal volume | 45 |
Journal issue | 39 |
Pages of publication | 15660 - 15670 |
a | 11.5925 ± 0.0009 Å |
b | 21.8177 ± 0.0011 Å |
c | 14.4054 ± 0.0011 Å |
α | 90° |
β | 111.477 ± 0.008° |
γ | 90° |
Cell volume | 3390.5 ± 0.4 Å3 |
Cell temperature | 150 ± 0.1 K |
Ambient diffraction temperature | 150 ± 0.1 K |
Number of distinct elements | 6 |
Space group number | 4 |
Hermann-Mauguin space group symbol | P 1 21 1 |
Hall space group symbol | P 2yb |
Residual factor for all reflections | 0.0608 |
Residual factor for significantly intense reflections | 0.0455 |
Weighted residual factors for significantly intense reflections | 0.081 |
Weighted residual factors for all reflections included in the refinement | 0.0892 |
Goodness-of-fit parameter for all reflections included in the refinement | 1.033 |
Diffraction radiation wavelength | 0.71073 Å |
Diffraction radiation type | MoKα |