Information card for entry 7040896
Formula | C16 H17 N17 Si |
Calculated formula | C16 H17 N17 Si |
SMILES | [Si]1(N=N#N)(N=N#N)([n]2ccccc2c2[n]1cccc2)(n1nnc(n1)C)n1nnnc1C.N#CC |
Title of publication | Synthesis of six-coordinate mono-, bis-, and tris(tetrazolato) complexes via [3 + 2] cycloadditions of nitriles to silicon-bound azido ligands. |
Authors of publication | Portius, Peter; Davis, Martin |
Journal of publication | Dalton transactions (Cambridge, England : 2003) |
Year of publication | 2016 |
Journal volume | 45 |
Journal issue | 43 |
Pages of publication | 17141 - 17152 |
a | 10.876 ± 0.0003 Å |
b | 14.5601 ± 0.0004 Å |
c | 14.9281 ± 0.0004 Å |
α | 90° |
β | 110.732 ± 0.002° |
γ | 90° |
Cell volume | 2210.87 ± 0.11 Å3 |
Cell temperature | 96 ± 2 K |
Ambient diffraction temperature | 96 ± 2 K |
Number of distinct elements | 4 |
Space group number | 14 |
Hermann-Mauguin space group symbol | P 1 21/c 1 |
Hall space group symbol | -P 2ybc |
Residual factor for all reflections | 0.0806 |
Residual factor for significantly intense reflections | 0.0473 |
Weighted residual factors for significantly intense reflections | 0.1079 |
Weighted residual factors for all reflections included in the refinement | 0.1278 |
Goodness-of-fit parameter for all reflections included in the refinement | 1.038 |
Diffraction radiation wavelength | 0.71073 Å |
Diffraction radiation type | MoKα |