Information card for entry 7041353
Formula | C94 H96 Cu4 F12 N6 O16 P8 |
Calculated formula | C94 H96 Cu4 F12 N6 O16 P8 |
Title of publication | Multidentate 2-pyridyl-phosphine ligands - towards ligand tuning and chirality. |
Authors of publication | Hanf, S.; García-Rodríguez, R; Feldmann, S.; Bond, A. D.; Hey-Hawkins, E; Wright, D. S. |
Journal of publication | Dalton transactions (Cambridge, England : 2003) |
Year of publication | 2017 |
Journal volume | 46 |
Journal issue | 3 |
Pages of publication | 814 - 824 |
a | 13.4157 ± 0.0004 Å |
b | 18.3267 ± 0.0006 Å |
c | 20.2257 ± 0.0006 Å |
α | 90° |
β | 91.545 ± 0.0018° |
γ | 90° |
Cell volume | 4971 ± 0.3 Å3 |
Cell temperature | 180 ± 2 K |
Ambient diffraction temperature | 180 ± 2 K |
Number of distinct elements | 7 |
Space group number | 14 |
Hermann-Mauguin space group symbol | P 1 21/n 1 |
Hall space group symbol | -P 2yn |
Residual factor for all reflections | 0.1046 |
Residual factor for significantly intense reflections | 0.0736 |
Weighted residual factors for significantly intense reflections | 0.159 |
Weighted residual factors for all reflections included in the refinement | 0.1786 |
Goodness-of-fit parameter for all reflections included in the refinement | 1.063 |
Diffraction radiation wavelength | 1.5418 Å |
Diffraction radiation type | CuKα |