Information card for entry 7042590
Formula | C48 H80 N4 O4 Ti |
Calculated formula | C48 H80 N4 O4 Ti |
Title of publication | Ligands and complexes based on piperidine and their exploitation of the ring opening polymerisation of rac-lactide. |
Authors of publication | McKeown, Paul; Brown-Humes, James; Davidson, Matthew G.; Mahon, Mary F.; Woodman, Timothy J.; Jones, Matthew D. |
Journal of publication | Dalton transactions (Cambridge, England : 2003) |
Year of publication | 2017 |
Journal volume | 46 |
Journal issue | 15 |
Pages of publication | 5048 - 5057 |
a | 9.7501 ± 0.0003 Å |
b | 14.1972 ± 0.0004 Å |
c | 19.0565 ± 0.0007 Å |
α | 76.731 ± 0.003° |
β | 80.759 ± 0.003° |
γ | 71.707 ± 0.003° |
Cell volume | 2426.49 ± 0.14 Å3 |
Cell temperature | 150 ± 2 K |
Ambient diffraction temperature | 150 ± 0.1 K |
Number of distinct elements | 5 |
Space group number | 2 |
Hermann-Mauguin space group symbol | P -1 |
Hall space group symbol | -P 1 |
Residual factor for all reflections | 0.0429 |
Residual factor for significantly intense reflections | 0.0398 |
Weighted residual factors for significantly intense reflections | 0.1068 |
Weighted residual factors for all reflections included in the refinement | 0.1091 |
Goodness-of-fit parameter for all reflections included in the refinement | 1.034 |
Diffraction radiation probe | x-ray |
Diffraction radiation wavelength | 1.54184 Å |
Diffraction radiation type | CuKα |