Information card for entry 7045097
Formula | C32 H25 N O2 Sn |
Calculated formula | C32 H25 N O2 Sn |
SMILES | C(=O)(c1ccccc1/C=N/c1ccccc1)O[Sn](c1ccccc1)(c1ccccc1)c1ccccc1 |
Title of publication | Triphenylstannyl((arylimino)methyl)benzoates with selective potency that induce G1 and G2/M cell cycle arrest and trigger apoptosis via ROS in human cervical cancer cells. |
Authors of publication | Basu Baul, Tushar S.; Longkumer, Imliwati; Duthie, Andrew; Singh, Priya; Koch, Biplob; Guedes da Silva, M Fátima C |
Journal of publication | Dalton transactions (Cambridge, England : 2003) |
Year of publication | 2018 |
Journal volume | 47 |
Journal issue | 6 |
Pages of publication | 1993 - 2008 |
a | 9.6664 ± 0.0003 Å |
b | 14.5629 ± 0.0006 Å |
c | 19.7869 ± 0.0007 Å |
α | 101.707 ± 0.003° |
β | 94.317 ± 0.004° |
γ | 96.279 ± 0.003° |
Cell volume | 2697.49 ± 0.17 Å3 |
Cell temperature | 296 ± 2 K |
Ambient diffraction temperature | 296 ± 2 K |
Number of distinct elements | 5 |
Space group number | 2 |
Hermann-Mauguin space group symbol | P -1 |
Hall space group symbol | -P 1 |
Residual factor for all reflections | 0.0552 |
Residual factor for significantly intense reflections | 0.0391 |
Weighted residual factors for significantly intense reflections | 0.0771 |
Weighted residual factors for all reflections included in the refinement | 0.0836 |
Goodness-of-fit parameter for all reflections included in the refinement | 1.055 |
Diffraction radiation wavelength | 0.71073 Å |
Diffraction radiation type | MoKα |