Information card for entry 7045486
Chemical name | 'tBuFOMeAu(II)Cl' |
Formula | C38 H48 Au2 Cl6 Fe2 N2 O2 |
Calculated formula | C38 H48 Au2 Cl6 Fe2 N2 O2 |
SMILES | [Au]1([c]23[Fe]456789%10([c]3([c]5([cH]6[cH]24)C)C2OC[C@@H]([N]=2[Au]([c]23[Fe]456%11%12%13%14([c]2([c]4([cH]5[cH]36)C)C2OC[C@@H]([N]1=2)C(C)(C)C)[cH]1[cH]%11[cH]%12[cH]%13[cH]%141)Cl)C(C)(C)C)[cH]1[cH]8[cH]9[cH]%10[cH]71)Cl.C(Cl)Cl.C(Cl)Cl |
Title of publication | Diastereoselective synthesis, structure and reactivity studies of ferrocenyloxazoline gold(i) and gold(ii) complexes. |
Authors of publication | Holz, Julia; Ayerbe García, Marta; Frey, Wolfgang; Krupp, Felix; Peters, René |
Journal of publication | Dalton transactions (Cambridge, England : 2003) |
Year of publication | 2018 |
Journal volume | 47 |
Journal issue | 11 |
Pages of publication | 3880 - 3905 |
a | 10.3753 ± 0.0007 Å |
b | 16.1108 ± 0.0009 Å |
c | 25.1352 ± 0.0014 Å |
α | 90° |
β | 90° |
γ | 90° |
Cell volume | 4201.5 ± 0.4 Å3 |
Cell temperature | 130 ± 2 K |
Ambient diffraction temperature | 130 ± 2 K |
Number of distinct elements | 7 |
Space group number | 19 |
Hermann-Mauguin space group symbol | P 21 21 21 |
Hall space group symbol | P 2ac 2ab |
Residual factor for all reflections | 0.0401 |
Residual factor for significantly intense reflections | 0.0274 |
Weighted residual factors for significantly intense reflections | 0.0365 |
Weighted residual factors for all reflections included in the refinement | 0.0382 |
Goodness-of-fit parameter for all reflections included in the refinement | 0.915 |
Diffraction radiation wavelength | 0.71073 Å |
Diffraction radiation type | MoKα |