Information card for entry 7045789
Formula | C12 H15 N3 O2 S |
Calculated formula | C12 H15 N3 O2 S |
Title of publication | Four-coordinated see-saw N-(aryl)-2-(propan-2-ylidene)hydrazinecarbothioamide complexes of nickel(ii), copper(ii) and zinc(ii) and their propensity for catalytic cyclisation. |
Authors of publication | Tarai, Arup; Baruah, Jubaraj B. |
Journal of publication | Dalton transactions (Cambridge, England : 2003) |
Year of publication | 2018 |
Journal volume | 47 |
Journal issue | 14 |
Pages of publication | 4921 - 4930 |
a | 14.662 ± 0.003 Å |
b | 7.5742 ± 0.0016 Å |
c | 13.561 ± 0.003 Å |
α | 90° |
β | 116.781 ± 0.007° |
γ | 90° |
Cell volume | 1344.4 ± 0.5 Å3 |
Cell temperature | 296 ± 2 K |
Ambient diffraction temperature | 296 ± 2 K |
Number of distinct elements | 5 |
Space group number | 14 |
Hermann-Mauguin space group symbol | P 1 21/c 1 |
Hall space group symbol | -P 2ybc |
Residual factor for all reflections | 0.0674 |
Residual factor for significantly intense reflections | 0.047 |
Weighted residual factors for significantly intense reflections | 0.1228 |
Weighted residual factors for all reflections included in the refinement | 0.1415 |
Goodness-of-fit parameter for all reflections included in the refinement | 1.037 |
Diffraction radiation wavelength | 0.71073 Å |
Diffraction radiation type | MoKα |