Information card for entry 7045852
Formula | C2 H3 Ag S2 |
Calculated formula | C2 H3 Ag S2 |
Title of publication | Silver(i) dithiocarboxylate complexes - clustering and aggregation. |
Authors of publication | Grote, Johanna; Neumann, Beate; Stammler, Hans-Georg; Mitzel, Norbert W. |
Journal of publication | Dalton transactions (Cambridge, England : 2003) |
Year of publication | 2018 |
Journal volume | 47 |
Journal issue | 17 |
Pages of publication | 6036 - 6040 |
a | 9.34406 ± 0.0002 Å |
b | 6.15316 ± 0.0001 Å |
c | 7.8771 ± 0.0002 Å |
α | 90° |
β | 99.95 ± 0.003° |
γ | 90° |
Cell volume | 446.086 ± 0.017 Å3 |
Cell temperature | 100.01 ± 0.1 K |
Ambient diffraction temperature | 100.01 ± 0.1 K |
Number of distinct elements | 4 |
Space group number | 14 |
Hermann-Mauguin space group symbol | P 1 21/c 1 |
Hall space group symbol | -P 2ybc |
Residual factor for all reflections | 0.0308 |
Residual factor for significantly intense reflections | 0.0304 |
Weighted residual factors for significantly intense reflections | 0.0922 |
Weighted residual factors for all reflections included in the refinement | 0.0925 |
Goodness-of-fit parameter for all reflections included in the refinement | 1.161 |
Diffraction radiation probe | x-ray |
Diffraction radiation wavelength | 1.54184 Å |
Diffraction radiation type | CuKα |