Information card for entry 7047155
Formula | C40 H34 N2 O6 Zr |
Calculated formula | C40 H34 N2 O6 Zr |
Title of publication | Fluorescent phenoxy benzoxazole complexes of zirconium and hafnium: synthesis, structure and photo-physical behaviour. |
Authors of publication | Kuhlmann, Lisa; Methling, Rafael; Simon, Jasmin; Neumann, Beate; Stammler, Hans-Georg; Strassert, Cristian A.; Mitzel, Norbert W. |
Journal of publication | Dalton transactions (Cambridge, England : 2003) |
Year of publication | 2018 |
Journal volume | 47 |
Journal issue | 32 |
Pages of publication | 11245 - 11252 |
a | 21.458 ± 0.0003 Å |
b | 18.0852 ± 0.0002 Å |
c | 25.5064 ± 0.0004 Å |
α | 90° |
β | 94.3075 ± 0.0013° |
γ | 90° |
Cell volume | 9870.4 ± 0.2 Å3 |
Cell temperature | 100 ± 0.2 K |
Ambient diffraction temperature | 100 ± 0.2 K |
Number of distinct elements | 5 |
Space group number | 15 |
Hermann-Mauguin space group symbol | C 1 2/c 1 |
Hall space group symbol | -C 2yc |
Residual factor for all reflections | 0.0335 |
Residual factor for significantly intense reflections | 0.0317 |
Weighted residual factors for significantly intense reflections | 0.0829 |
Weighted residual factors for all reflections included in the refinement | 0.084 |
Goodness-of-fit parameter for all reflections included in the refinement | 1.099 |
Diffraction radiation probe | x-ray |
Diffraction radiation wavelength | 0.71073 Å |
Diffraction radiation type | MoKα |