Information card for entry 7047442
Formula | C18 H17 Fe Mn0.5 N12 O4 |
Calculated formula | C18 H17 Fe Mn0.5 N12 O4 |
Title of publication | Two-electron redox-active tricyano iron(ii) complex with 2,4,6-tris(2-pyrimidyl)-1,3,5-triazine as a building block for coordination polymers. |
Authors of publication | Shiga, Takuya; Miyamoto, Haruka; Newton, Graham N.; Oshio, Hiroki |
Journal of publication | Dalton transactions (Cambridge, England : 2003) |
Year of publication | 2018 |
Journal volume | 47 |
Journal issue | 38 |
Pages of publication | 13402 - 13407 |
a | 7.096 ± 0.002 Å |
b | 12.045 ± 0.004 Å |
c | 13.365 ± 0.005 Å |
α | 75.886 ± 0.004° |
β | 83.782 ± 0.005° |
γ | 75.639 ± 0.004° |
Cell volume | 1071.8 ± 0.6 Å3 |
Cell temperature | 100 ± 2 K |
Ambient diffraction temperature | 100 ± 2 K |
Number of distinct elements | 6 |
Space group number | 2 |
Hermann-Mauguin space group symbol | P -1 |
Hall space group symbol | -P 1 |
Residual factor for all reflections | 0.0948 |
Residual factor for significantly intense reflections | 0.0587 |
Weighted residual factors for significantly intense reflections | 0.1122 |
Weighted residual factors for all reflections included in the refinement | 0.1304 |
Goodness-of-fit parameter for all reflections included in the refinement | 1.022 |
Diffraction radiation wavelength | 0.71073 Å |
Diffraction radiation type | MoKα |