Information card for entry 7047590
Formula | C4 H24 B20 Co O10 P2 |
Calculated formula | C4 H24 B20 Co O10 P2 |
Title of publication | All inorganic coordination polymers have been made possible with the m-carboranylphosphinate ligand. |
Authors of publication | Oleshkevich, Elena; Romero, Isabel; Teixidor, Francesc; Viñas, Clara |
Journal of publication | Dalton transactions (Cambridge, England : 2003) |
Year of publication | 2018 |
Journal volume | 47 |
Journal issue | 41 |
Pages of publication | 14785 - 14798 |
a | 11.184 ± 0.002 Å |
b | 7.435 ± 0.0015 Å |
c | 17.041 ± 0.003 Å |
α | 90° |
β | 91.21 ± 0.03° |
γ | 90° |
Cell volume | 1416.7 ± 0.5 Å3 |
Cell temperature | 100 ± 2 K |
Ambient diffraction temperature | 100 ± 2 K |
Number of distinct elements | 6 |
Space group number | 12 |
Hermann-Mauguin space group symbol | C 1 2/m 1 |
Hall space group symbol | -C 2y |
Residual factor for all reflections | 0.0898 |
Residual factor for significantly intense reflections | 0.0868 |
Weighted residual factors for significantly intense reflections | 0.2434 |
Weighted residual factors for all reflections included in the refinement | 0.2473 |
Goodness-of-fit parameter for all reflections included in the refinement | 1.073 |
Diffraction radiation wavelength | 0.79989 Å |
Diffraction radiation type | synchrotronradiation |