Information card for entry 7047779
Formula | C22 H22 Cl Co N4 O10 |
Calculated formula | C22 H22 Cl Co N4 O10 |
Title of publication | A mononuclear cobalt complex for water oxidation: new controversies and puzzles. |
Authors of publication | Safdari, Rasoul; Mohammadi, Mohammad Reza; Hołyńska, Małgorzata; Chernev, Petko; Dau, Holger; Najafpour, Mohammad Mahdi |
Journal of publication | Dalton transactions (Cambridge, England : 2003) |
Year of publication | 2018 |
Journal volume | 47 |
Journal issue | 46 |
Pages of publication | 16668 - 16673 |
a | 8.445 ± 0.003 Å |
b | 11.908 ± 0.003 Å |
c | 12.414 ± 0.004 Å |
α | 99.74 ± 0.03° |
β | 103.51 ± 0.03° |
γ | 90.24 ± 0.03° |
Cell volume | 1195.1 ± 0.7 Å3 |
Cell temperature | 100 ± 2 K |
Ambient diffraction temperature | 100 ± 2 K |
Number of distinct elements | 6 |
Space group number | 2 |
Hermann-Mauguin space group symbol | P -1 |
Hall space group symbol | -P 1 |
Residual factor for all reflections | 0.0283 |
Residual factor for significantly intense reflections | 0.0258 |
Weighted residual factors for significantly intense reflections | 0.0739 |
Weighted residual factors for all reflections included in the refinement | 0.0755 |
Goodness-of-fit parameter for all reflections included in the refinement | 1.016 |
Diffraction radiation wavelength | 0.71073 Å |
Diffraction radiation type | MoKα |