Information card for entry 7047849
Formula | C25 H11 Ce F18 N2 O6 |
Calculated formula | C25 H11 Ce F17.985 N2 O6 |
Title of publication | Stoichiometric control: 8- and 10-coordinate Ln(hfac)<sub>3</sub>(bpy) and Ln(hfac)<sub>3</sub>(bpy)<sub>2</sub> complexes of the early lanthanides La-Sm. |
Authors of publication | Fatila, Elisabeth M.; Maahs, Adam C.; Hetherington, Erin E.; Cooper, Brandon J.; Cooper, Riley E.; Daanen, Nick N.; Jennings, Michael; Skrabalak, Sara E.; Preuss, Kathryn E. |
Journal of publication | Dalton transactions (Cambridge, England : 2003) |
Year of publication | 2018 |
Journal volume | 47 |
Journal issue | 45 |
Pages of publication | 16232 - 16241 |
a | 11.993 ± 0.002 Å |
b | 15.829 ± 0.003 Å |
c | 17.833 ± 0.004 Å |
α | 78.46 ± 0.03° |
β | 76.46 ± 0.03° |
γ | 72.69 ± 0.03° |
Cell volume | 3111.1 ± 1.2 Å3 |
Cell temperature | 150 ± 2 K |
Ambient diffraction temperature | 150 ± 2 K |
Number of distinct elements | 6 |
Space group number | 2 |
Hermann-Mauguin space group symbol | P -1 |
Hall space group symbol | -P 1 |
Residual factor for all reflections | 0.1387 |
Residual factor for significantly intense reflections | 0.0653 |
Weighted residual factors for significantly intense reflections | 0.1582 |
Weighted residual factors for all reflections included in the refinement | 0.2038 |
Goodness-of-fit parameter for all reflections included in the refinement | 1.051 |
Diffraction radiation wavelength | 0.71073 Å |
Diffraction radiation type | MoKα |