Information card for entry 7049143
Formula | C39 H54 Co I N10 O3 |
Calculated formula | C39 H54 Co I N10 O3 |
Title of publication | Anionic guest-dependent slow magnetic relaxation in Co(ii) tripodal iminopyridine complexes. |
Authors of publication | Klug, Christina M.; Ozumerzifon, Tarik J.; Bhowmick, Indrani; Livesay, Brooke N.; Rappé, Anthony K; Shores, Matthew P. |
Journal of publication | Dalton transactions (Cambridge, England : 2003) |
Year of publication | 2019 |
Journal volume | 48 |
Journal issue | 25 |
Pages of publication | 9117 - 9126 |
a | 15.8091 ± 0.0007 Å |
b | 15.8091 ± 0.0007 Å |
c | 12.0675 ± 0.001 Å |
α | 90° |
β | 90° |
γ | 120° |
Cell volume | 2611.9 ± 0.3 Å3 |
Cell temperature | 120 ± 2 K |
Ambient diffraction temperature | 120 ± 2 K |
Number of distinct elements | 6 |
Space group number | 147 |
Hermann-Mauguin space group symbol | P -3 |
Hall space group symbol | -P 3 |
Residual factor for all reflections | 0.0454 |
Residual factor for significantly intense reflections | 0.0348 |
Weighted residual factors for significantly intense reflections | 0.0984 |
Weighted residual factors for all reflections included in the refinement | 0.1026 |
Goodness-of-fit parameter for all reflections included in the refinement | 1.086 |
Diffraction radiation wavelength | 0.71073 Å |
Diffraction radiation type | MoKα |