Information card for entry 7049161
Formula | C31 H47 Cl2 Se7 Ta3 |
Calculated formula | C31.005 H45 Cl2.009 Se7 Ta3 |
Title of publication | Chalcogen stabilized trimetallic clusters: synthesis, structures, and bonding of [(Cp*M)<sub>3</sub>(E)<sub>6+m</sub>(BH)<sub>n</sub>] (M = Nb or Ta; E = S or Se; m = 0 or 1 or 2; n = 0 or 1). |
Authors of publication | Kar, Sourav; Bairagi, Subhash; Saha, Koushik; Raghavendra, Beesam; Ghosh, Sundargopal |
Journal of publication | Dalton transactions (Cambridge, England : 2003) |
Year of publication | 2019 |
Journal volume | 48 |
Journal issue | 13 |
Pages of publication | 4203 - 4210 |
a | 15.9449 ± 0.0006 Å |
b | 17.1036 ± 0.0006 Å |
c | 16.1118 ± 0.0005 Å |
α | 90° |
β | 90° |
γ | 90° |
Cell volume | 4393.9 ± 0.3 Å3 |
Cell temperature | 296 ± 2 K |
Ambient diffraction temperature | 296 ± 2 K |
Number of distinct elements | 5 |
Space group number | 36 |
Hermann-Mauguin space group symbol | C m c 21 |
Hall space group symbol | C 2c -2 |
Residual factor for all reflections | 0.0347 |
Residual factor for significantly intense reflections | 0.0297 |
Weighted residual factors for significantly intense reflections | 0.0718 |
Weighted residual factors for all reflections included in the refinement | 0.0745 |
Goodness-of-fit parameter for all reflections included in the refinement | 1.051 |
Diffraction radiation wavelength | 0.71073 Å |
Diffraction radiation type | MoKα |