Information card for entry 7049170
Formula | C70 H46 Dy2 F18 N2 O14 |
Calculated formula | C70 H46 Dy2 F18 N2 O14 |
Title of publication | From zero-dimensional to one-dimensional chain N-oxide bridged compounds with enhanced single-molecule magnetic performance. |
Authors of publication | Zhang, Ling; Chen, Peng; Li, Hong-Feng; Tian, Yong-Mei; Yan, Peng-Fei; Sun, Wen-Bin |
Journal of publication | Dalton transactions (Cambridge, England : 2003) |
Year of publication | 2019 |
Journal volume | 48 |
Journal issue | 13 |
Pages of publication | 4324 - 4332 |
a | 14.941 ± 0.0006 Å |
b | 14.3461 ± 0.0012 Å |
c | 17.122 ± 0.0008 Å |
α | 90° |
β | 101.175 ± 0.004° |
γ | 90° |
Cell volume | 3600.4 ± 0.4 Å3 |
Cell temperature | 293 ± 2 K |
Ambient diffraction temperature | 293 ± 2 K |
Number of distinct elements | 6 |
Space group number | 14 |
Hermann-Mauguin space group symbol | P 1 21/n 1 |
Hall space group symbol | -P 2yn |
Residual factor for all reflections | 0.0753 |
Residual factor for significantly intense reflections | 0.0425 |
Weighted residual factors for significantly intense reflections | 0.0745 |
Weighted residual factors for all reflections included in the refinement | 0.0892 |
Goodness-of-fit parameter for all reflections included in the refinement | 1.118 |
Diffraction radiation wavelength | 0.71073 Å |
Diffraction radiation type | MoKα |