Information card for entry 7049174
Formula | Ge Li2 S4 Zn |
Calculated formula | Ge Li2 S4 Zn |
Title of publication | Li<sub>2</sub>ZnGeS<sub>4</sub>: a promising diamond-like infrared nonlinear optical material with high laser damage threshold and outstanding second-harmonic generation response. |
Authors of publication | Huang, Yi; Wu, Kui; Cheng, Jianian; Chu, Yu; Yang, Zhihua; Pan, Shilie |
Journal of publication | Dalton transactions (Cambridge, England : 2003) |
Year of publication | 2019 |
Journal volume | 48 |
Journal issue | 14 |
Pages of publication | 4484 - 4488 |
a | 6.213 ± 0.005 Å |
b | 6.525 ± 0.005 Å |
c | 7.83 ± 0.006 Å |
α | 90° |
β | 90.7° |
γ | 90° |
Cell volume | 317.4 ± 0.4 Å3 |
Cell temperature | 296 ± 2 K |
Ambient diffraction temperature | 296 ± 2 K |
Number of distinct elements | 4 |
Space group number | 7 |
Hermann-Mauguin space group symbol | P 1 n 1 |
Hall space group symbol | P -2yac |
Residual factor for all reflections | 0.0795 |
Residual factor for significantly intense reflections | 0.058 |
Weighted residual factors for significantly intense reflections | 0.1404 |
Weighted residual factors for all reflections included in the refinement | 0.1617 |
Goodness-of-fit parameter for all reflections included in the refinement | 1.166 |
Diffraction radiation wavelength | 0.71073 Å |
Diffraction radiation type | MoKα |