Information card for entry 7049211
Formula | C33 H21 Cu I N3 |
Calculated formula | C33 H21 Cu I N3 |
Title of publication | Crystal-engineering and luminescence studies of 1,3,5-tris(3-pyridylethynyl)benzene or 1,3,5-tris(4-pyridylethynyl)benzene with copper(i) iodides. |
Authors of publication | Tzeng, Biing-Chiau; Lin, Jun-Fu |
Journal of publication | Dalton transactions (Cambridge, England : 2003) |
Year of publication | 2019 |
Journal volume | 48 |
Journal issue | 12 |
Pages of publication | 4046 - 4057 |
a | 9.898 ± 0.001 Å |
b | 9.9893 ± 0.001 Å |
c | 15.3085 ± 0.0015 Å |
α | 107.079 ± 0.002° |
β | 98.609 ± 0.002° |
γ | 98.887 ± 0.002° |
Cell volume | 1398.7 ± 0.2 Å3 |
Cell temperature | 293 ± 2 K |
Ambient diffraction temperature | 293 ± 2 K |
Number of distinct elements | 5 |
Space group number | 2 |
Hermann-Mauguin space group symbol | P -1 |
Hall space group symbol | -P 1 |
Residual factor for all reflections | 0.0424 |
Residual factor for significantly intense reflections | 0.0326 |
Weighted residual factors for significantly intense reflections | 0.0778 |
Weighted residual factors for all reflections included in the refinement | 0.1022 |
Goodness-of-fit parameter for all reflections included in the refinement | 1.118 |
Diffraction radiation wavelength | 0.71073 Å |
Diffraction radiation type | MoKα |