Information card for entry 7049221
Formula | B2 O24 Pr2 S6 |
Calculated formula | B2 O24 Pr2 S6 |
Title of publication | RE<sub>2</sub>[B<sub>2</sub>(SO<sub>4</sub>)<sub>6</sub>] (RE = Y, La-Nd, Sm, Eu, Tb-Lu): a silicate-analogous host structure with weak coordination behaviour. |
Authors of publication | Netzsch, Philip; Hämmer, Matthias; Gross, Peter; Bariss, Harijs; Block, Theresa; Heletta, Lukas; Pöttgen, Rainer; Bruns, Jörn; Huppertz, Hubert; Höppe, Henning A |
Journal of publication | Dalton transactions (Cambridge, England : 2003) |
Year of publication | 2019 |
Journal volume | 48 |
Journal issue | 13 |
Pages of publication | 4387 - 4397 |
a | 13.7141 ± 0.0011 Å |
b | 11.5305 ± 0.0009 Å |
c | 11.2643 ± 0.0009 Å |
α | 90° |
β | 93.638 ± 0.002° |
γ | 90° |
Cell volume | 1777.6 ± 0.2 Å3 |
Cell temperature | 300 ± 2 K |
Ambient diffraction temperature | 300 ± 2 K |
Number of distinct elements | 4 |
Space group number | 15 |
Hermann-Mauguin space group symbol | C 1 2/c 1 |
Hall space group symbol | -C 2yc |
Residual factor for all reflections | 0.016 |
Residual factor for significantly intense reflections | 0.014 |
Weighted residual factors for significantly intense reflections | 0.0337 |
Weighted residual factors for all reflections included in the refinement | 0.0343 |
Goodness-of-fit parameter for all reflections included in the refinement | 1.109 |
Diffraction radiation wavelength | 0.71073 Å |
Diffraction radiation type | MoKα |