Information card for entry 7049223
Formula | B2 Dy2 O24 S6 |
Calculated formula | B2 Dy2 O24 S6 |
Title of publication | RE<sub>2</sub>[B<sub>2</sub>(SO<sub>4</sub>)<sub>6</sub>] (RE = Y, La-Nd, Sm, Eu, Tb-Lu): a silicate-analogous host structure with weak coordination behaviour. |
Authors of publication | Netzsch, Philip; Hämmer, Matthias; Gross, Peter; Bariss, Harijs; Block, Theresa; Heletta, Lukas; Pöttgen, Rainer; Bruns, Jörn; Huppertz, Hubert; Höppe, Henning A |
Journal of publication | Dalton transactions (Cambridge, England : 2003) |
Year of publication | 2019 |
Journal volume | 48 |
Journal issue | 13 |
Pages of publication | 4387 - 4397 |
a | 13.5683 ± 0.0019 Å |
b | 11.4248 ± 0.0016 Å |
c | 10.9703 ± 0.0017 Å |
α | 90° |
β | 93.45 ± 0.004° |
γ | 90° |
Cell volume | 1697.5 ± 0.4 Å3 |
Cell temperature | 301 ± 2 K |
Ambient diffraction temperature | 301 ± 2 K |
Number of distinct elements | 4 |
Space group number | 15 |
Hermann-Mauguin space group symbol | C 1 2/c 1 |
Hall space group symbol | -C 2yc |
Residual factor for all reflections | 0.0336 |
Residual factor for significantly intense reflections | 0.0217 |
Weighted residual factors for significantly intense reflections | 0.0434 |
Weighted residual factors for all reflections included in the refinement | 0.0453 |
Goodness-of-fit parameter for all reflections included in the refinement | 1.04 |
Diffraction radiation wavelength | 0.71073 Å |
Diffraction radiation type | MoKα |