Information card for entry 7049258
Formula | C42 H34 Dy2 F12 N6 O18 S4 |
Calculated formula | C42 H34 Dy2 F12 N6 O18 S4 |
Title of publication | High local coordination symmetry around the spin center and the alignment between magnetic and symmetric axes together play a crucial role in single-molecule magnet performance. |
Authors of publication | Yang, Zhao-Fu; Tian, Yong-Mei; Zhang, Wan-Ying; Chen, Peng; Li, Hong-Feng; Zhang, Yi-Quan; Sun, Wen-Bin |
Journal of publication | Dalton transactions (Cambridge, England : 2003) |
Year of publication | 2019 |
Journal volume | 48 |
Journal issue | 15 |
Pages of publication | 4931 - 4940 |
a | 11.5623 ± 0.0012 Å |
b | 11.9207 ± 0.0013 Å |
c | 19.877 ± 0.003 Å |
α | 90° |
β | 96.515 ± 0.012° |
γ | 90° |
Cell volume | 2722 ± 0.6 Å3 |
Cell temperature | 293 ± 2 K |
Ambient diffraction temperature | 293 ± 2 K |
Number of distinct elements | 7 |
Space group number | 14 |
Hermann-Mauguin space group symbol | P 1 21/n 1 |
Hall space group symbol | -P 2yn |
Residual factor for all reflections | 0.0952 |
Residual factor for significantly intense reflections | 0.0584 |
Weighted residual factors for significantly intense reflections | 0.1195 |
Weighted residual factors for all reflections included in the refinement | 0.1419 |
Goodness-of-fit parameter for all reflections included in the refinement | 1.056 |
Diffraction radiation wavelength | 0.71073 Å |
Diffraction radiation type | MoKα |