Information card for entry 7049269
Formula | C66 H98 Er2 N4 O6 Si2 |
Calculated formula | C66 H98 Er2 N4 O6 Si2 |
Title of publication | Synthesis, characterization, and reactivity of dinuclear organo-rare-earth-metal alkyl complexes supported by 2-amidate-functionalized indolyl ligands: substituent effects on coordination and reactivity. |
Authors of publication | Hong, Dongjing; Zhu, Xiancui; Wang, Shaowu; Wei, Yun; Zhou, Shuangliu; Huang, Zeming; Zhu, Shan; Wang, Ruru; Yue, Wenrun; Mu, Xiaolong |
Journal of publication | Dalton transactions (Cambridge, England : 2003) |
Year of publication | 2019 |
Journal volume | 48 |
Journal issue | 16 |
Pages of publication | 5230 - 5242 |
a | 11.8031 ± 0.001 Å |
b | 17.2359 ± 0.0015 Å |
c | 17.5507 ± 0.0015 Å |
α | 90° |
β | 97.166 ± 0.001° |
γ | 90° |
Cell volume | 3542.6 ± 0.5 Å3 |
Cell temperature | 293 ± 2 K |
Ambient diffraction temperature | 293.15 K |
Number of distinct elements | 6 |
Space group number | 14 |
Hermann-Mauguin space group symbol | P 1 21/n 1 |
Hall space group symbol | -P 2yn |
Residual factor for all reflections | 0.074 |
Residual factor for significantly intense reflections | 0.0504 |
Weighted residual factors for significantly intense reflections | 0.1241 |
Weighted residual factors for all reflections included in the refinement | 0.1363 |
Goodness-of-fit parameter for all reflections included in the refinement | 1.064 |
Diffraction radiation wavelength | 0.71073 Å |
Diffraction radiation type | MoKα |