Information card for entry 7049275
Formula | C103 H106 N14 O3 Yb2 |
Calculated formula | C103 H106 N14 O3 Yb2 |
Title of publication | Synthesis, characterization, and reactivity of dinuclear organo-rare-earth-metal alkyl complexes supported by 2-amidate-functionalized indolyl ligands: substituent effects on coordination and reactivity. |
Authors of publication | Hong, Dongjing; Zhu, Xiancui; Wang, Shaowu; Wei, Yun; Zhou, Shuangliu; Huang, Zeming; Zhu, Shan; Wang, Ruru; Yue, Wenrun; Mu, Xiaolong |
Journal of publication | Dalton transactions (Cambridge, England : 2003) |
Year of publication | 2019 |
Journal volume | 48 |
Journal issue | 16 |
Pages of publication | 5230 - 5242 |
a | 14.7004 ± 0.0008 Å |
b | 14.9519 ± 0.0009 Å |
c | 23.7312 ± 0.0014 Å |
α | 101.471 ± 0.001° |
β | 96.269 ± 0.001° |
γ | 93.278 ± 0.001° |
Cell volume | 5064.6 ± 0.5 Å3 |
Cell temperature | 293 ± 2 K |
Ambient diffraction temperature | 293.15 K |
Number of distinct elements | 5 |
Space group number | 2 |
Hermann-Mauguin space group symbol | P -1 |
Hall space group symbol | -P 1 |
Residual factor for all reflections | 0.0678 |
Residual factor for significantly intense reflections | 0.0461 |
Weighted residual factors for significantly intense reflections | 0.1099 |
Weighted residual factors for all reflections included in the refinement | 0.1187 |
Goodness-of-fit parameter for all reflections included in the refinement | 0.984 |
Diffraction radiation wavelength | 0.71073 Å |
Diffraction radiation type | MoKα |