Information card for entry 7049280
Formula | C68 H84 N6 O6 Si2 Yb2 |
Calculated formula | C68 H84 N6 O6 Si2 Yb2 |
Title of publication | Synthesis, characterization, and reactivity of dinuclear organo-rare-earth-metal alkyl complexes supported by 2-amidate-functionalized indolyl ligands: substituent effects on coordination and reactivity. |
Authors of publication | Hong, Dongjing; Zhu, Xiancui; Wang, Shaowu; Wei, Yun; Zhou, Shuangliu; Huang, Zeming; Zhu, Shan; Wang, Ruru; Yue, Wenrun; Mu, Xiaolong |
Journal of publication | Dalton transactions (Cambridge, England : 2003) |
Year of publication | 2019 |
Journal volume | 48 |
Journal issue | 16 |
Pages of publication | 5230 - 5242 |
a | 11.095 ± 0.004 Å |
b | 14.589 ± 0.006 Å |
c | 16.114 ± 0.006 Å |
α | 112.592 ± 0.004° |
β | 91.52 ± 0.005° |
γ | 110.684 ± 0.005° |
Cell volume | 2212.8 ± 1.5 Å3 |
Cell temperature | 293 ± 2 K |
Ambient diffraction temperature | 293.15 K |
Number of distinct elements | 6 |
Space group number | 2 |
Hermann-Mauguin space group symbol | P -1 |
Hall space group symbol | -P 1 |
Residual factor for all reflections | 0.0826 |
Residual factor for significantly intense reflections | 0.0704 |
Weighted residual factors for significantly intense reflections | 0.1882 |
Weighted residual factors for all reflections included in the refinement | 0.2032 |
Goodness-of-fit parameter for all reflections included in the refinement | 1.084 |
Diffraction radiation wavelength | 0.71073 Å |
Diffraction radiation type | MoKα |