Information card for entry 7049283
Formula | C84 H90 N8 O6 Yb2 |
Calculated formula | C84 H90 N8 O6 Yb2 |
Title of publication | Synthesis, characterization, and reactivity of dinuclear organo-rare-earth-metal alkyl complexes supported by 2-amidate-functionalized indolyl ligands: substituent effects on coordination and reactivity. |
Authors of publication | Hong, Dongjing; Zhu, Xiancui; Wang, Shaowu; Wei, Yun; Zhou, Shuangliu; Huang, Zeming; Zhu, Shan; Wang, Ruru; Yue, Wenrun; Mu, Xiaolong |
Journal of publication | Dalton transactions (Cambridge, England : 2003) |
Year of publication | 2019 |
Journal volume | 48 |
Journal issue | 16 |
Pages of publication | 5230 - 5242 |
a | 32.297 ± 0.007 Å |
b | 14.388 ± 0.003 Å |
c | 25.203 ± 0.009 Å |
α | 90° |
β | 128.886 ± 0.002° |
γ | 90° |
Cell volume | 9116 ± 4 Å3 |
Cell temperature | 293 ± 2 K |
Ambient diffraction temperature | 293.15 K |
Number of distinct elements | 5 |
Space group number | 15 |
Hermann-Mauguin space group symbol | C 1 2/c 1 |
Hall space group symbol | -C 2yc |
Residual factor for all reflections | 0.0757 |
Residual factor for significantly intense reflections | 0.0555 |
Weighted residual factors for significantly intense reflections | 0.141 |
Weighted residual factors for all reflections included in the refinement | 0.1587 |
Goodness-of-fit parameter for all reflections included in the refinement | 1.027 |
Diffraction radiation wavelength | 0.71073 Å |
Diffraction radiation type | MoKα |