Information card for entry 7049300
Formula | C31 H38 Cu N2 O3 |
Calculated formula | C31 H38 Cu N2 O3 |
Title of publication | Mono- and dinuclear copper complexes coordinated on NNO-tridentate Schiff-base derivatives for copolymerization of cyclohexene oxide and cyclic anhydrides. |
Authors of publication | Cheng, Fu-Yin; Tsai, Chen-Yen; Huang, Bor-Hunn; Lu, Kuan-Yeh; Lin, Chu-Chieh; Ko, Bao-Tsan |
Journal of publication | Dalton transactions (Cambridge, England : 2003) |
Year of publication | 2019 |
Journal volume | 48 |
Journal issue | 14 |
Pages of publication | 4667 - 4676 |
a | 8.7657 ± 0.0003 Å |
b | 10.5785 ± 0.0006 Å |
c | 15.578 ± 0.0008 Å |
α | 81.054 ± 0.005° |
β | 88.318 ± 0.004° |
γ | 81.086 ± 0.004° |
Cell volume | 1409.69 ± 0.12 Å3 |
Cell temperature | 150 ± 2 K |
Ambient diffraction temperature | 150 ± 2 K |
Number of distinct elements | 5 |
Space group number | 2 |
Hermann-Mauguin space group symbol | P -1 |
Hall space group symbol | -P 1 |
Residual factor for all reflections | 0.0462 |
Residual factor for significantly intense reflections | 0.0371 |
Weighted residual factors for significantly intense reflections | 0.1021 |
Weighted residual factors for all reflections included in the refinement | 0.107 |
Goodness-of-fit parameter for all reflections included in the refinement | 1.01 |
Diffraction radiation wavelength | 0.71073 Å |
Diffraction radiation type | MoKα |