Information card for entry 7049305
Formula | C31 H19 F24 Mn2 N4 O10 |
Calculated formula | C31 H19 F24 Mn2 N4 O10 |
Title of publication | Syntheses and magnetic properties of a bis-tridentate nitronyl nitroxide radical and its metal complexes. |
Authors of publication | Miao, Hao; Li, Miao; Li, Hong-Qing; Shen, Fu-Xing; Zhang, Yi-Quan; Wang, Xin-Yi |
Journal of publication | Dalton transactions (Cambridge, England : 2003) |
Year of publication | 2019 |
Journal volume | 48 |
Journal issue | 15 |
Pages of publication | 4774 - 4778 |
a | 12.207 ± 0.005 Å |
b | 12.761 ± 0.005 Å |
c | 14.489 ± 0.005 Å |
α | 87.736 ± 0.006° |
β | 77.249 ± 0.006° |
γ | 80.846 ± 0.005° |
Cell volume | 2173.3 ± 1.4 Å3 |
Cell temperature | 296 ± 2 K |
Ambient diffraction temperature | 296 ± 2 K |
Number of distinct elements | 6 |
Space group number | 2 |
Hermann-Mauguin space group symbol | P -1 |
Hall space group symbol | -P 1 |
Residual factor for all reflections | 0.1076 |
Residual factor for significantly intense reflections | 0.0733 |
Weighted residual factors for significantly intense reflections | 0.1762 |
Weighted residual factors for all reflections included in the refinement | 0.2035 |
Goodness-of-fit parameter for all reflections included in the refinement | 1.075 |
Diffraction radiation wavelength | 0.71073 Å |
Diffraction radiation type | MoKα |