Information card for entry 7049312
Formula | C32 H44 N4 O15 Zn2 |
Calculated formula | C32 H44 N4 O15 Zn2 |
Title of publication | Stimulus-responsive reversible thermochromism and exciplex emission of a Zn(ii) complex and selective sensing of NH<sub>3</sub> gas. |
Authors of publication | Miao, Jinling; Nie, Yong; Xiong, Zhixin; Chai, Yongshuai; Fu, Shuqing; Yan, Hong |
Journal of publication | Dalton transactions (Cambridge, England : 2003) |
Year of publication | 2019 |
Journal volume | 48 |
Journal issue | 15 |
Pages of publication | 5000 - 5006 |
a | 26.1429 ± 0.001 Å |
b | 7.5779 ± 0.0002 Å |
c | 18.5411 ± 0.0007 Å |
α | 90° |
β | 97.456 ± 0.003° |
γ | 90° |
Cell volume | 3642.1 ± 0.2 Å3 |
Cell temperature | 291 ± 2 K |
Ambient diffraction temperature | 291.15 K |
Number of distinct elements | 5 |
Space group number | 15 |
Hermann-Mauguin space group symbol | C 1 2/c 1 |
Hall space group symbol | -C 2yc |
Residual factor for all reflections | 0.0508 |
Residual factor for significantly intense reflections | 0.0324 |
Weighted residual factors for significantly intense reflections | 0.0708 |
Weighted residual factors for all reflections included in the refinement | 0.0773 |
Goodness-of-fit parameter for all reflections included in the refinement | 1.032 |
Diffraction radiation wavelength | 0.71073 Å |
Diffraction radiation type | MoKα |