Information card for entry 7049355
Formula | C80 H72 Cl5 F3 O7 P4 Ru2 |
Calculated formula | C80 H72 Cl5 F3 O7 P4 Ru2 |
Title of publication | Ru(O<sub>2</sub>CCF<sub>3</sub>)<sub>2</sub>(PPh<sub>3</sub>)<sub>2</sub> and ruthenium phosphine complexes bearing fluoroacetate ligands: synthesis, characterization and catalytic activity. |
Authors of publication | Hey, Daniela A.; Fischer, Pauline J.; Baratta, Walter; Kühn, Fritz E |
Journal of publication | Dalton transactions (Cambridge, England : 2003) |
Year of publication | 2019 |
Journal volume | 48 |
Journal issue | 14 |
Pages of publication | 4625 - 4635 |
a | 13.584 ± 0.003 Å |
b | 39.646 ± 0.009 Å |
c | 14.247 ± 0.003 Å |
α | 90° |
β | 100.978 ± 0.013° |
γ | 90° |
Cell volume | 7532 ± 3 Å3 |
Cell temperature | 100 K |
Ambient diffraction temperature | 100 K |
Number of distinct elements | 7 |
Space group number | 14 |
Hermann-Mauguin space group symbol | P 1 21/n 1 |
Hall space group symbol | -P 2yn |
Residual factor for all reflections | 0.0832 |
Residual factor for significantly intense reflections | 0.0486 |
Weighted residual factors for significantly intense reflections | 0.1102 |
Weighted residual factors for all reflections included in the refinement | 0.1249 |
Goodness-of-fit parameter for all reflections included in the refinement | 1.025 |
Diffraction radiation probe | x-ray |
Diffraction radiation wavelength | 0.71073 Å |
Diffraction radiation type | MoKα |