Information card for entry 7049412
Formula | C46 H36 N8 P2 Pt2 |
Calculated formula | C46 H36 N8 P2 Pt2 |
Title of publication | A double rollover cycloplatinated(ii) skeleton: a versatile platform for tuning emission by chelating and non-chelating ancillary ligand systems. |
Authors of publication | Paziresh, Sareh; Babadi Aghakhanpour, Reza; Fuertes, Sara; Sicilia, Violeta; Niroomand Hosseini, Fatemeh; Nabavizadeh, S. Masoud |
Journal of publication | Dalton transactions (Cambridge, England : 2003) |
Year of publication | 2019 |
Journal volume | 48 |
Journal issue | 17 |
Pages of publication | 5713 - 5724 |
a | 9.2323 ± 0.0014 Å |
b | 9.5583 ± 0.0015 Å |
c | 12.8452 ± 0.0019 Å |
α | 110.033 ± 0.002° |
β | 90.129 ± 0.002° |
γ | 110.867 ± 0.002° |
Cell volume | 985.1 ± 0.3 Å3 |
Cell temperature | 100 ± 2 K |
Ambient diffraction temperature | 100 ± 2 K |
Number of distinct elements | 5 |
Space group number | 2 |
Hermann-Mauguin space group symbol | P -1 |
Hall space group symbol | -P 1 |
Residual factor for all reflections | 0.0672 |
Residual factor for significantly intense reflections | 0.0594 |
Weighted residual factors for significantly intense reflections | 0.1622 |
Weighted residual factors for all reflections included in the refinement | 0.1669 |
Goodness-of-fit parameter for all reflections included in the refinement | 1.133 |
Diffraction radiation wavelength | 0.71073 Å |
Diffraction radiation type | MoKα |